Target
Somatostatin receptor type 4
Ligand
BDBM276001
Substrate
Meas. Tech.
Camp Assay
EC50
5500±n/a nM
Citation
 Mazzaferro, RFerrara, MGiovannini, RLingard, IRudolf, K Morpholine and 1,4-oxazepane amides as somatostatin receptor subtype 4 (SSTR4) agonists US Patent  US10577336 Publication Date 3/3/2020 
Target
Name:
Somatostatin receptor type 4
Synonyms:
SOMATOSTATIN SST4 SS4-R SSR4_HUMAN SSTR4 | Somatostatin receptor type 4 (SSTR4)
Type:
Enzyme
Mol. Mass.:
42015.38
Organism:
Homo sapiens (Human)
Description:
P31391
Residue:
388
  
Inhibitor
Name:
BDBM276001
Synonyms:
US10071974, Example 112 US10577336, Example 113
Type:
Small organic molecule
Emp. Form.:
C19H28N4O2
Mol. Mass.:
344.4512
SMILES:
CC(C)CC(C)(NC(=O)[C@@H]1CNCCO1)c1ncc2c(C)cccn12
: