Target
Epidermal growth factor receptor
Ligand
BDBM270575
Substrate
Meas. Tech.
High Throughput EGFR Biochemical Assay
EC50
102±n/a nM
Citation
 Balan, GChou, CKim, MKirschberg, TALink, JOPhillips, GSaito, RDSquires, NHTaylor, JGWatkins, WJWright, NE Cot modulators and methods of use thereof US Patent  US10577352 Publication Date 3/3/2020 
Target
Name:
Epidermal growth factor receptor
Synonyms:
EGF Receptor Substrate EGFR_HUMAN ERBB1 Epidermal Growth Factor Receptor erbB-1 Epidermal growth factor receptor (EGFR) HER1 Proto-oncogene c-ErbB-1 Tyrosine-Protein Kinase ErbB-1
Type:
Receptor Kinase Domain
Mol. Mass.:
134279.59
Organism:
Homo sapiens (Human)
Description:
P00533
Residue:
1210
  
Inhibitor
Name:
BDBM270575
Synonyms:
(S)-3-((1- cyclopropyl-1H- 1,2,3-triazol-4- yl)((4- (neopentylamino) quinazolin-6- yl)amino)methyl- d)benzonitrile US10577352, Compound I-7
Type:
Small organic molecule
Emp. Form.:
C26H28N8
Mol. Mass.:
452.5541
SMILES:
CC(C)(C)CNc1ncnc2ccc(NC(c3cn(nn3)C3CC3)c3cccc(c3)C#N)cc12
: