Target
Epidermal growth factor receptor
Ligand
BDBM270576
Substrate
Meas. Tech.
High Throughput EGFR Biochemical Assay
EC50
169±n/a nM
Citation
 Balan, GChou, CKim, MKirschberg, TALink, JOPhillips, GSaito, RDSquires, NHTaylor, JGWatkins, WJWright, NE Cot modulators and methods of use thereof US Patent  US10577352 Publication Date 3/3/2020 
Target
Name:
Epidermal growth factor receptor
Synonyms:
EGF Receptor Substrate EGFR_HUMAN ERBB1 Epidermal Growth Factor Receptor erbB-1 Epidermal growth factor receptor (EGFR) HER1 Proto-oncogene c-ErbB-1 Tyrosine-Protein Kinase ErbB-1
Type:
Receptor Kinase Domain
Mol. Mass.:
134279.59
Organism:
Homo sapiens (Human)
Description:
P00533
Residue:
1210
  
Inhibitor
Name:
BDBM270576
Synonyms:
(S)-N6-((2- chlorophenyl)(1- cyclopropyl-1H- 1,2,3-triazol-4- yl)methyl)-N4- neopentylquinazoline- 4,6-diamine US10577352, Compound I-8
Type:
Small organic molecule
Emp. Form.:
C25H28ClN7
Mol. Mass.:
461.99
SMILES:
CC(C)(C)CNc1ncnc2ccc(N[C@H](c3cn(nn3)C3CC3)c3ccccc3Cl)cc12
: