Target
Mu-type opioid receptor
Ligand
BDBM432151
Substrate
Meas. Tech.
Human mu-Opioid Receptor Radioligand Assay
Ki
<100±n/a nM
Citation
 Goya, PTorrens-Jover, AAlmansa-Rosales, CDiaz-Fernández, JCaamaño-Moure, A Arylamide derivatives having multimodal activity against pain US Patent  US10577360 Publication Date 3/3/2020 
Target
Name:
Mu-type opioid receptor
Synonyms:
M-OR-1 MOR-1 MUOR1 Mu opiate receptor OPRM1 hMOP | mu-type opioid receptor isoform MOR-1
Type:
G Protein-Coupled Receptor (GPCR)
Mol. Mass.:
44789.51
Organism:
Homo sapiens (Human)
Description:
P35372
Residue:
400
  
Inhibitor
Name:
BDBM432151
Synonyms:
N-(1-Benzylpiperidin-4-yl)-N-(1-phenyl-1H-pyrazol-3-yl)thiophene-2-carboxamide | US10577360, Example 17
Type:
Small organic molecule
Emp. Form.:
C26H26N4OS
Mol. Mass.:
442.576
SMILES:
O=C(N(C1CCN(Cc2ccccc2)CC1)c1ccn(n1)-c1ccccc1)c1cccs1
: