Target
D(3) dopamine receptor
Ligand
BDBM50139922
Substrate
Meas. Tech.
[3H]-Spiperone Binding Assay at hD3
Ki
126±n/a nM
Citation
 Cremonesi, SMicheli, FSemeraro, TTarsi, L Dopamine D3 receptor antagonists having a morpholine moiety US Patent  US10577361 Publication Date 3/3/2020 
Target
Name:
D(3) dopamine receptor
Synonyms:
DOPAMINE D3 DRD3_HUMAN Dopamine D3 receptor (D3) Dopamine receptor Dopamine receptor D3
Type:
Mol. Mass.:
44243.43
Organism:
Homo sapiens (Human)
Description:
Residue:
400
  
Inhibitor
Name:
BDBM50139922
Synonyms:
CHEMBL3765072 | US10577361, E21
Type:
Small organic molecule
Emp. Form.:
C25H26F3N7OS
Mol. Mass.:
529.58
SMILES:
Cn1c(SCCCN2CCOC(C2)c2ccc(cc2)C(F)(F)F)nnc1-c1ccc(cc1)-n1cnnc1
: