Target
D(3) dopamine receptor
Ligand
BDBM50139859
Substrate
Meas. Tech.
[3H]-Spiperone Binding Assay at hD3
Ki
295±n/a nM
Citation
 Cremonesi, SMicheli, FSemeraro, TTarsi, L Dopamine D3 receptor antagonists having a morpholine moiety US Patent  US10577361 Publication Date 3/3/2020 
Target
Name:
D(3) dopamine receptor
Synonyms:
DOPAMINE D3 DRD3_HUMAN Dopamine D3 receptor (D3) Dopamine receptor Dopamine receptor D3
Type:
Mol. Mass.:
44243.43
Organism:
Homo sapiens (Human)
Description:
Residue:
400
  
Inhibitor
Name:
BDBM50139859
Synonyms:
CHEMBL3764212 | US10577361, E23
Type:
Small organic molecule
Emp. Form.:
C24H26F3N5O2S
Mol. Mass.:
505.556
SMILES:
Cn1c(SCCCN2CCOC(C2)c2ccc(cc2)C(F)(F)F)nnc1-c1cccc(c1)C(N)=O
: