Target
D(2) dopamine receptor
Ligand
BDBM50139867
Substrate
Meas. Tech.
[3H]-Spiperone Binding Assay at hD2 Recombinant Receptor
Ki
7244±n/a nM
Citation
 Cremonesi, SMicheli, FSemeraro, TTarsi, L Dopamine D3 receptor antagonists having a morpholine moiety US Patent  US10577361 Publication Date 3/3/2020 
Target
Name:
D(2) dopamine receptor
Synonyms:
D(2) dopamine receptor DOPAMINE D2 Long DRD2 Dopamine D2 receptor Dopamine D2 receptor (D2R) Dopamine2-like | d2
Type:
Cell-surface receptors
Mol. Mass.:
50647.10
Organism:
Homo sapiens (Human)
Description:
P14416
Residue:
443
  
Inhibitor
Name:
BDBM50139867
Synonyms:
CHEMBL3764884 | US10577361, E26
Type:
Small organic molecule
Emp. Form.:
C20H22F3N5OS2
Mol. Mass.:
469.547
SMILES:
Cn1c(SCCCN2CCOC(C2)c2ccc(cc2)C(F)(F)F)nnc1-c1nccs1
: