Target
Histone-lysine N-methyltransferase SMYD3
Ligand
BDBM433063
Substrate
Meas. Tech.
SMYD3 Biochemical Assay
IC50
0.400±n/a nM
Citation
 Mitchell, LHBell, ASChesworth, RFoley, MAKuntz, KWMills, JEMunchhof, MJ Substituted piperidine compounds US Patent  US10577363 Publication Date 3/3/2020 
Target
Name:
Histone-lysine N-methyltransferase SMYD3
Synonyms:
SET and MYND domain-containing protein 3 SMYD3_HUMAN ZNFN3A1 | Zinc finger MYND domain-containing protein 1
Type:
Enzyme
Mol. Mass.:
49101.22
Organism:
Homo sapiens (Human)
Description:
Q9H7B4-2
Residue:
428
  
Inhibitor
Name:
BDBM433063
Synonyms:
5-cyclopropyl-N-((1R,3R,5S)-8-(((1S,4S)- 4-((2- hydroxyethyl)amino)cyclohexyl)sulfonyl)- 8-azabicyclo[3.2.1]octan-3-yl)isoxazole-3- carboxamide | US10577363, Compound 767
Type:
Small organic molecule
Emp. Form.:
C22H34N4O5S
Mol. Mass.:
466.594
SMILES:
OCCN[C@H]1CC[C@H](CC1)S(=O)(=O)N1[C@H]2CC[C@@H]1C[C@@H](C2)NC(=O)c1cc(on1)C1CC1
: