Target
Histone-lysine N-methyltransferase SMYD3
Ligand
BDBM433065
Substrate
Meas. Tech.
SMYD3 Biochemical Assay
IC50
0.760±n/a nM
Citation
 Mitchell, LHBell, ASChesworth, RFoley, MAKuntz, KWMills, JEMunchhof, MJ Substituted piperidine compounds US Patent  US10577363 Publication Date 3/3/2020 
Target
Name:
Histone-lysine N-methyltransferase SMYD3
Synonyms:
SET and MYND domain-containing protein 3 SMYD3_HUMAN ZNFN3A1 | Zinc finger MYND domain-containing protein 1
Type:
Enzyme
Mol. Mass.:
49101.22
Organism:
Homo sapiens (Human)
Description:
Q9H7B4-2
Residue:
428
  
Inhibitor
Name:
BDBM433065
Synonyms:
5-cyclopropyl-N-((1R,3r,5S)-8-((7- phenethyl-2,7-diazaspiro[3.5]nonan-2- yl)sulfonyl)-8-azabicyclo[3.2.1]octan-3- yl)isoxazole-3-carboxamide | US10577363, Compound 769
Type:
Small organic molecule
Emp. Form.:
C29H39N5O4S
Mol. Mass.:
553.716
SMILES:
O=C(N[C@@H]1C[C@@H]2CC[C@H](C1)N2S(=O)(=O)N1CC2(C1)CCN(CCc1ccccc1)CC2)c1cc(on1)C1CC1
: