Target
Interleukin-1 receptor-associated kinase 4
Ligand
BDBM374088
Substrate
Meas. Tech.
Biochemical Assay
IC50
<100.0±n/a nM
Citation
 Chan, TGuckian, KJenkins, TThomas, JVessels, JKumaravel, GMeissner, RLyssikatos, JLucas, BLeaf, IDuffield, J IRAK4 inhibiting agents US Patent  US10577367 Publication Date 3/3/2020 
Target
Name:
Interleukin-1 receptor-associated kinase 4
Synonyms:
IRAK-4 IRAK4_HUMAN Interleukin-1 receptor-associated kinase 4 (IRAK4) | Renal carcinoma antigen NY-REN-64
Type:
Protein
Mol. Mass.:
51519.08
Organism:
Homo sapiens (Human)
Description:
Q9NWZ3
Residue:
460
  
Inhibitor
Name:
BDBM374088
Synonyms:
6-(6-(5-aminopyridin-3-yl)imidazo[1,5-a]pyridin-3-yl)picolinonitrile US10577367, Example 76
Type:
Small organic molecule
Emp. Form.:
C18H12N6
Mol. Mass.:
312.3281
SMILES:
Nc1cncc(c1)-c1ccc2cnc(-c3cccc(n3)C#N)n2c1
: