Target
Interleukin-1 receptor-associated kinase 4
Ligand
BDBM374107
Substrate
Meas. Tech.
Biochemical Assay
IC50
<100.0±n/a nM
Citation
 Chan, TGuckian, KJenkins, TThomas, JVessels, JKumaravel, GMeissner, RLyssikatos, JLucas, BLeaf, IDuffield, J IRAK4 inhibiting agents US Patent  US10577367 Publication Date 3/3/2020 
Target
Name:
Interleukin-1 receptor-associated kinase 4
Synonyms:
IRAK-4 IRAK4_HUMAN Interleukin-1 receptor-associated kinase 4 (IRAK4) | Renal carcinoma antigen NY-REN-64
Type:
Protein
Mol. Mass.:
51519.08
Organism:
Homo sapiens (Human)
Description:
Q9NWZ3
Residue:
460
  
Inhibitor
Name:
BDBM374107
Synonyms:
6-(6-(1-aminoethyl)pyridin-2-yl)-N-methyl-1-(6-methylpyridin-2-yl)-1H-indazole-4-carboxamide US10577367, Example 115
Type:
Small organic molecule
Emp. Form.:
C22H22N6O
Mol. Mass.:
386.4497
SMILES:
CNC(=O)c1cc(cc2n(ncc12)-c1cccc(C)n1)-c1cccc(n1)C(C)N
: