Target
Interleukin-1 receptor-associated kinase 4
Ligand
BDBM374090
Substrate
Meas. Tech.
Biochemical Assay
IC50
<100.0±n/a nM
Citation
 Chan, TGuckian, KJenkins, TThomas, JVessels, JKumaravel, GMeissner, RLyssikatos, JLucas, BLeaf, IDuffield, J IRAK4 inhibiting agents US Patent  US10577367 Publication Date 3/3/2020 
Target
Name:
Interleukin-1 receptor-associated kinase 4
Synonyms:
IRAK-4 IRAK4_HUMAN Interleukin-1 receptor-associated kinase 4 (IRAK4) | Renal carcinoma antigen NY-REN-64
Type:
Protein
Mol. Mass.:
51519.08
Organism:
Homo sapiens (Human)
Description:
Q9NWZ3
Residue:
460
  
Inhibitor
Name:
BDBM374090
Synonyms:
1-(6-(3-(6-(trifluoromethyl)pyridin-2-yl)imidazo[1,5-a]pyridin-6-yl)pyridin-2-yl)ethanamine US10246456, Example 223 US10577367, Example 223
Type:
Small organic molecule
Emp. Form.:
C20H16F3N5
Mol. Mass.:
383.3697
SMILES:
CC(N)c1cccc(n1)-c1ccc2cnc(-c3cccc(n3)C(F)(F)F)n2c1
: