Target
Interleukin-1 receptor-associated kinase 4
Ligand
BDBM374310
Substrate
Meas. Tech.
Biochemical Assay
IC50
<100.0±n/a nM
Citation
 Chan, TGuckian, KJenkins, TThomas, JVessels, JKumaravel, GMeissner, RLyssikatos, JLucas, BLeaf, IDuffield, J IRAK4 inhibiting agents US Patent  US10577367 Publication Date 3/3/2020 
Target
Name:
Interleukin-1 receptor-associated kinase 4
Synonyms:
IRAK-4 IRAK4_HUMAN Interleukin-1 receptor-associated kinase 4 (IRAK4) | Renal carcinoma antigen NY-REN-64
Type:
Protein
Mol. Mass.:
51519.08
Organism:
Homo sapiens (Human)
Description:
Q9NWZ3
Residue:
460
  
Inhibitor
Name:
BDBM374310
Synonyms:
(S)-(6-(6-(6-(1-aminoethyl)pyridin-2-yl)-4-(3-methoxypropoxy)-1H-indazol-1-yl)pyridin-2-yl)methanol US10577367, Example 458
Type:
Small organic molecule
Emp. Form.:
C24H27N5O3
Mol. Mass.:
433.5029
SMILES:
COCCCOc1cc(cc2n(ncc12)-c1cccc(CO)n1)-c1cccc(n1)[C@H](C)N
: