Target
Toll-like receptor 9
Ligand
BDBM235727
Substrate
Meas. Tech.
TLR9 Antagonist Assay
IC50
137±n/a nM
Citation
 Lipford, GBZepp, CM Immune system modulators US Patent  US10117875 Publication Date 11/6/2018 
Target
Name:
Toll-like receptor 9
Synonyms:
CD_antigen: CD289 TLR9_HUMAN
Type:
Enzyme
Mol. Mass.:
115889.91
Organism:
Homo sapiens (Human)
Description:
Q9NR96
Residue:
1032
  
Inhibitor
Name:
BDBM235727
Synonyms:
US10117875, Example 70 | US9359361, 70
Type:
Small organic molecule
Emp. Form.:
C30H35N7O3
Mol. Mass.:
541.644
SMILES:
O=c1c(nc2c(NCCN3CCOCC3)nc(nc2n1CCN1CCOCC1)-c1ccccc1)-c1ccccc1
: