Target
Tyrosine-protein kinase JAK2
Ligand
BDBM433332
Substrate
Meas. Tech.
Enzymatic Activity Assay
IC50
<20.0±n/a nM
Citation
 Zhu, LXiao, DHu, YDai, LDuan, XSun, YPeng, YKong, FLuo, HHan, YYang, LWang, S Pyrrolopyrimidine compound US Patent  US10561657 Publication Date 2/18/2020 
Target
Name:
Tyrosine-protein kinase JAK2
Synonyms:
JAK-2 JAK2_HUMAN Janus kinase 2 (JAK2) | Janus kinase 2 (a protein tyrosine kinase)
Type:
Protein
Mol. Mass.:
130684.68
Organism:
Homo sapiens (Human)
Description:
O60674
Residue:
1132
  
Inhibitor
Name:
BDBM433332
Synonyms:
US10561657, Example 11
Type:
Small organic molecule
Emp. Form.:
C23H30N8O
Mol. Mass.:
434.5373
SMILES:
N#CCC(C1CCCC1)n1cc(c(NCCN2CCOCC2)n1)-c1ncnc2[nH]ccc12
: