Target
Plasma kallikrein
Ligand
BDBM433405
Substrate
Meas. Tech.
Activity Assay
Ki
>100.0±n/a nM
Citation
 Kotian, PLBabu, YSKumar, VSZhang, WVogeti, L Human plasma kallikrein inhibitors US Patent  US10562850 Publication Date 2/18/2020 
Target
Name:
Plasma kallikrein
Synonyms:
Fletcher factor KLKB1 Kallikrein Plasma kallikrein heavy chain Plasma prekallikrein
Type:
Protein
Mol. Mass.:
71391.16
Organism:
Homo sapiens (Human)
Description:
P03952
Residue:
638
  
Inhibitor
Name:
BDBM433405
Synonyms:
US10562850, Compound 27b | US11066360, Compound 27b
Type:
Small organic molecule
Emp. Form.:
C32H31F4N5O3
Mol. Mass.:
609.6139
SMILES:
NC(CCC1CC1)(c1cccc(c1)C#N)c1ccc(F)c(NC(=O)[C@H]2C[C@@H](O)CN2C(=O)Nc2ccc(cc2)C(F)(F)F)c1
: