Target
Plasma kallikrein
Ligand
BDBM433412
Substrate
Meas. Tech.
Activity Assay
Ki
<50.0±n/a nM
Citation
 Kotian, PLBabu, YSKumar, VSZhang, WVogeti, L Human plasma kallikrein inhibitors US Patent  US10562850 Publication Date 2/18/2020 
Target
Name:
Plasma kallikrein
Synonyms:
Fletcher factor KLKB1 Kallikrein Plasma kallikrein heavy chain Plasma prekallikrein
Type:
Protein
Mol. Mass.:
71391.16
Organism:
Homo sapiens (Human)
Description:
P03952
Residue:
638
  
Inhibitor
Name:
BDBM433412
Synonyms:
US10562850, Compound 29e | US11066360, Compound 29e
Type:
Small organic molecule
Emp. Form.:
C36H34ClFN6O3
Mol. Mass.:
653.145
SMILES:
NC(CCC1CC1)(c1cccc(c1)C#N)c1ccc(F)c(NC(=O)[C@H]2C[C@@](O)(CN2C(=O)Nc2ccc(Cl)cn2)c2ccccc2)c1
: