Target
Alpha-1A adrenergic receptor
Ligand
BDBM433495
Substrate
Meas. Tech.
Radioligand Binding Assay
Ki
190±n/a nM
Citation
 Sniecikowska, JBucki, ANewman-Tancredi, AVarney, MA Compounds for treating disorders sensitive to serotoninergic regulation controlled by the 5-HT1A receptors US Patent  US10562853 Publication Date 2/18/2020 
Target
Name:
Alpha-1A adrenergic receptor
Synonyms:
ADA1A_HUMAN ADRA1C Alpha 1A-adrenoceptor Alpha adrenergic receptor 1a Alpha-adrenergic receptor 1c adrenergic Alpha1 | adrenergic Alpha1C
Type:
Cell-surface receptors
Mol. Mass.:
51511.67
Organism:
Homo sapiens (Human)
Description:
P35348
Residue:
466
  
Inhibitor
Name:
BDBM433495
Synonyms:
US10562853, Compound 15
Type:
Small organic molecule
Emp. Form.:
C23H25Cl2FN2O4
Mol. Mass.:
483.36
SMILES:
FC1(CNCCOc2cccc3OCCOc23)CCN(CC1)C(=O)c1ccc(Cl)c(Cl)c1
: