Target
D(2) dopamine receptor
Ligand
BDBM433527
Substrate
Meas. Tech.
Radioligand Binding Assay
Ki
>1000±n/a nM
Citation
 Sniecikowska, JBucki, ANewman-Tancredi, AVarney, MA Compounds for treating disorders sensitive to serotoninergic regulation controlled by the 5-HT1A receptors US Patent  US10562853 Publication Date 2/18/2020 
Target
Name:
D(2) dopamine receptor
Synonyms:
D(2) dopamine receptor DOPAMINE D2 Long DRD2 Dopamine D2 receptor Dopamine D2 receptor (D2R) Dopamine2-like | d2
Type:
Cell-surface receptors
Mol. Mass.:
50647.10
Organism:
Homo sapiens (Human)
Description:
P14416
Residue:
443
  
Inhibitor
Name:
BDBM433527
Synonyms:
US10562853, Compound 48
Type:
Small organic molecule
Emp. Form.:
C22H24ClF2N3O3
Mol. Mass.:
451.894
SMILES:
NC(=O)c1ccccc1OCCNCC1(F)CCN(CC1)C(=O)c1ccc(F)c(Cl)c1
: