Target
D(2) dopamine receptor
Ligand
BDBM433533
Substrate
Meas. Tech.
Radioligand Binding Assay
Ki
>1000±n/a nM
Citation
 Sniecikowska, JBucki, ANewman-Tancredi, AVarney, MA Compounds for treating disorders sensitive to serotoninergic regulation controlled by the 5-HT1A receptors US Patent  US10562853 Publication Date 2/18/2020 
Target
Name:
D(2) dopamine receptor
Synonyms:
D(2) dopamine receptor DOPAMINE D2 Long DRD2 Dopamine D2 receptor Dopamine D2 receptor (D2R) Dopamine2-like | d2
Type:
Cell-surface receptors
Mol. Mass.:
50647.10
Organism:
Homo sapiens (Human)
Description:
P14416
Residue:
443
  
Inhibitor
Name:
BDBM433533
Synonyms:
US10562853, Compound 54
Type:
Small organic molecule
Emp. Form.:
C20H23ClF2N4O
Mol. Mass.:
408.873
SMILES:
Fc1ccc(cc1Cl)C(=O)N1CCC(F)(CNCCNc2ccccn2)CC1
: