Target
Alpha-1A adrenergic receptor
Ligand
BDBM433535
Substrate
Meas. Tech.
Radioligand Binding Assay
Ki
>1000±n/a nM
Citation
 Sniecikowska, JBucki, ANewman-Tancredi, AVarney, MA Compounds for treating disorders sensitive to serotoninergic regulation controlled by the 5-HT1A receptors US Patent  US10562853 Publication Date 2/18/2020 
Target
Name:
Alpha-1A adrenergic receptor
Synonyms:
ADA1A_HUMAN ADRA1C Alpha 1A-adrenoceptor Alpha adrenergic receptor 1a Alpha-adrenergic receptor 1c adrenergic Alpha1 | adrenergic Alpha1C
Type:
Cell-surface receptors
Mol. Mass.:
51511.67
Organism:
Homo sapiens (Human)
Description:
P35348
Residue:
466
  
Inhibitor
Name:
BDBM433535
Synonyms:
US10562853, Compound 58
Type:
Small organic molecule
Emp. Form.:
C22H25ClF2N4O3
Mol. Mass.:
466.909
SMILES:
CC(=O)Nc1cccc(OCCNCC2(F)CCN(CC2)C(=O)c2ccc(F)c(Cl)c2)n1
: