Target
D(2) dopamine receptor
Ligand
BDBM21393
Substrate
Meas. Tech.
Radioligand Binding Assay
Ki
>1000±n/a nM
Citation
 Sniecikowska, JBucki, ANewman-Tancredi, AVarney, MA Compounds for treating disorders sensitive to serotoninergic regulation controlled by the 5-HT1A receptors US Patent  US10562853 Publication Date 2/18/2020 
Target
Name:
D(2) dopamine receptor
Synonyms:
D(2) dopamine receptor DOPAMINE D2 Long DRD2 Dopamine D2 receptor Dopamine D2 receptor (D2R) Dopamine2-like | d2
Type:
Cell-surface receptors
Mol. Mass.:
50647.10
Organism:
Homo sapiens (Human)
Description:
P14416
Residue:
443
  
Inhibitor
Name:
BDBM21393
Synonyms:
7-(dipropylamino)-5,6,7,8-tetrahydronaphthalen-1-ol 8-OH-DPAT 8-OH-DPAT,(-) CHEMBL1788118 CHEMBL56 US10562853, Compound 8-OH-DPAT cid_1220
Type:
radiolabeled ligand
Emp. Form.:
C16H25NO
Mol. Mass.:
247.3758
SMILES:
CCCN(CCC)C1CCc2cccc(O)c2C1
: