Target
Prokineticin receptor 1
Ligand
BDBM433600
Substrate
Meas. Tech.
Biological Assay
IC50
2170±n/a nM
Citation
 Goldby, AJenkins, KTeall, M Piperidine derivatives for use in the treatment or prevention of psychiatric and neurological conditions US Patent  US10562882 Publication Date 2/18/2020 
Target
Name:
Prokineticin receptor 1
Synonyms:
G-protein coupled receptor 73 GPR73 PK-R1 PKR1_HUMAN | PROKR1
Type:
enzyme
Mol. Mass.:
44779.92
Organism:
Homo sapiens (Human)
Description:
Q8TCW9
Residue:
393
  
Inhibitor
Name:
BDBM433600
Synonyms:
5-[3-(1-Ethyl-3-methyl-1H-indol-2-yl)piperidine-1-carbonyl]-N-methylpyridazin-3-amine | US10562882, Example 18
Type:
Small organic molecule
Emp. Form.:
C22H27N5O
Mol. Mass.:
377.4827
SMILES:
CCn1c(C2CCCN(C2)C(=O)c2cnnc(NC)c2)c(C)c2ccccc12
: