Target
Receptor tyrosine-protein kinase erbB-2
Ligand
BDBM297484
Substrate
Meas. Tech.
HER2 Degradation Assay with BT-474 Cell Line
IC50
>5000±n/a nM
Citation
 Chimmanamada, DUYing, W Targeted therapeutics US Patent  US10117944 Publication Date 11/6/2018 
Target
Name:
Receptor tyrosine-protein kinase erbB-2
Synonyms:
2.7.10.1 CD_antigen=CD340 ERBB2_HUMAN FASN/HER2 HER2 MLN19 NEU Proto-oncogene Neu Tyrosine kinase-type cell surface receptor HER2 | p185erbB2
Type:
Mol. Mass.:
137894.47
Organism:
Homo sapiens (Human)
Description:
P04626
Residue:
1255
  
Inhibitor
Name:
BDBM297484
Synonyms:
US10117944, Compound SDC-TRAP-0239
Type:
Small organic molecule
Emp. Form.:
C51H59BN8O8
Mol. Mass.:
922.874
SMILES:
CC(C)C[C@H](NC(O)[C@H](Cc1ccccc1)NC(=O)c1cnccn1)B1OC(C)(C)C(C)(O1)c1ccc(cc1)C(=O)N1CCc2ccc(cc2C1)-n1c(O)nnc1-c1cc(C(C)C)c(O)cc1O
: