Target
Protein mono-ADP-ribosyltransferase PARP14 [1611-1801]
Ligand
BDBM434410
Substrate
Meas. Tech.
Enzymatic Inhibition Assay
IC50
<1000±n/a nM
Citation
 Schenkel, LBVasbinder, MMKuntz, KWSwinger, KK Quinazolinones as PARP14 inhibitors US Patent  US10562891 Publication Date 2/18/2020 
Target
Name:
Protein mono-ADP-ribosyltransferase PARP14 [1611-1801]
Synonyms:
BAL2 PAR14_HUMAN Protein mono-ADP-ribosyltransferase PARP14 (aa 1611-1801)
Type:
Enzyme Catalytic Domain
Mol. Mass.:
21749.94
Organism:
Homo sapiens (Human)
Description:
aa 1611-1801
Residue:
190
  
Inhibitor
Name:
BDBM434410
Synonyms:
US10562891, Example 326 US10562891, Example 327b | US11008308, Example 326
Type:
Small organic molecule
Emp. Form.:
C21H27F2N3O3S
Mol. Mass.:
439.519
SMILES:
CN1CC[C@H](COc2cc(F)c3c(c2)nc(CSC2CCOCC2)[nH]c3=O)[C@@H](F)C1
: