Target
Protein mono-ADP-ribosyltransferase PARP14 [1611-1801]
Ligand
BDBM434452
Substrate
Meas. Tech.
Enzymatic Inhibition Assay
IC50
<1000±n/a nM
Citation
 Schenkel, LBVasbinder, MMKuntz, KWSwinger, KK Quinazolinones as PARP14 inhibitors US Patent  US10562891 Publication Date 2/18/2020 
Target
Name:
Protein mono-ADP-ribosyltransferase PARP14 [1611-1801]
Synonyms:
BAL2 PAR14_HUMAN Protein mono-ADP-ribosyltransferase PARP14 (aa 1611-1801)
Type:
Enzyme Catalytic Domain
Mol. Mass.:
21749.94
Organism:
Homo sapiens (Human)
Description:
aa 1611-1801
Residue:
190
  
Inhibitor
Name:
BDBM434452
Synonyms:
US10562891, Example 366 | US11008308, Example 366
Type:
Small organic molecule
Emp. Form.:
C21H25F3N2O3S
Mol. Mass.:
442.495
SMILES:
Fc1cc(OCC2CCOCC2)cc2nc(CSC3CCC(F)(F)CC3)[nH]c(=O)c12
: