Target
Fibroblast growth factor receptor 1
Ligand
BDBM434573
Substrate
Meas. Tech.
Enzyme Kinase Activity Assay
IC50
<100±n/a nM
Citation
 Geng, MLiu, LJiang, LHuang, MZha, CAi, JWang, LCao, JDing, J Indazole compounds as FGFR kinase inhibitor, preparation and use thereof US Patent  US10562900 Publication Date 2/18/2020 
Target
Name:
Fibroblast growth factor receptor 1
Synonyms:
BFGFR Basic fibroblast growth factor receptor 1 (FGFR1) CEK FGFR-1 FGFR-1, (FL) FGFR1_HUMAN FLT2 Fibroblast growth factor receptor 1 (FGFR-1) Fms-like tyrosine kinase 2 N-sam bFGF-R | c-fgr
Type:
Receptor
Mol. Mass.:
91861.70
Organism:
Homo sapiens (Human)
Description:
P11362
Residue:
822
  
Inhibitor
Name:
BDBM434573
Synonyms:
US10562900, Example 70
Type:
Small organic molecule
Emp. Form.:
C25H23Cl2N5O4
Mol. Mass.:
528.387
SMILES:
COc1cc(OC)c(Cl)c(c1Cl)-c1ccc2c(NC(=O)c3ccc(cc3)N3CCOCC3)n[nH]c2n1
: