Target
Fibroblast growth factor receptor 2
Ligand
BDBM434589
Substrate
Meas. Tech.
Enzyme Kinase Activity Assay
IC50
<100±n/a nM
Citation
 Geng, MLiu, LJiang, LHuang, MZha, CAi, JWang, LCao, JDing, J Indazole compounds as FGFR kinase inhibitor, preparation and use thereof US Patent  US10562900 Publication Date 2/18/2020 
Target
Name:
Fibroblast growth factor receptor 2
Synonyms:
BEK FGFR-2 FGFR2 Fibroblast growth factor receptor 2 (FGFR2) KGFR Keratinocyte growth factor receptor VEGF-receptor 2 and Fibroblast growth factor receptor 2
Type:
Enzyme
Mol. Mass.:
92015.45
Organism:
Homo sapiens (Human)
Description:
P21802
Residue:
821
  
Inhibitor
Name:
BDBM434589
Synonyms:
US10562900, Example 96
Type:
Small organic molecule
Emp. Form.:
C25H25F2N7O3
Mol. Mass.:
509.5079
SMILES:
COc1cc(OC)c(F)c(-c2ccc3c(NC(=O)c4cnc(nc4)N4CCN(C)CC4)n[nH]c3c2)c1F
: