Target
Interleukin-1 receptor-associated kinase 4
Ligand
BDBM434633
Substrate
Meas. Tech.
Kinase Activity Inhibition Assay
IC50
5500±n/a nM
Citation
 Xu, JCai, QCha, MYKim, M IRAK4 inhibitor and use thereof US Patent  US10562902 Publication Date 2/18/2020 
Target
Name:
Interleukin-1 receptor-associated kinase 4
Synonyms:
IRAK-4 IRAK4_HUMAN Interleukin-1 receptor-associated kinase 4 (IRAK4) | Renal carcinoma antigen NY-REN-64
Type:
Protein
Mol. Mass.:
51519.08
Organism:
Homo sapiens (Human)
Description:
Q9NWZ3
Residue:
460
  
Inhibitor
Name:
BDBM434633
Synonyms:
US10562902, Compound 39
Type:
Small organic molecule
Emp. Form.:
C18H20N8S
Mol. Mass.:
380.47
SMILES:
CC(C)Nc1nc(Nc2cc(C)ns2)nc2ccn(-c3ccc(N)nc3)c12
: