Target
Interleukin-1 receptor-associated kinase 4
Ligand
BDBM434671
Substrate
Meas. Tech.
Kinase Activity Inhibition Assay
IC50
<100±n/a nM
Citation
 Xu, JCai, QCha, MYKim, M IRAK4 inhibitor and use thereof US Patent  US10562902 Publication Date 2/18/2020 
Target
Name:
Interleukin-1 receptor-associated kinase 4
Synonyms:
IRAK-4 IRAK4_HUMAN Interleukin-1 receptor-associated kinase 4 (IRAK4) | Renal carcinoma antigen NY-REN-64
Type:
Protein
Mol. Mass.:
51519.08
Organism:
Homo sapiens (Human)
Description:
Q9NWZ3
Residue:
460
  
Inhibitor
Name:
BDBM434671
Synonyms:
US10562902, Compound 77
Type:
Small organic molecule
Emp. Form.:
C18H18N7O2
Mol. Mass.:
364.3812
SMILES:
Cn1cc(cn1)-n1ccc2nc(Nc3ccnc3)nc(O[C@H]3CCOC3)c12
: