Target
Interleukin-1 receptor-associated kinase 4
Ligand
BDBM434706
Substrate
Meas. Tech.
Kinase Activity Inhibition Assay
IC50
<100±n/a nM
Citation
 Xu, JCai, QCha, MYKim, M IRAK4 inhibitor and use thereof US Patent  US10562902 Publication Date 2/18/2020 
Target
Name:
Interleukin-1 receptor-associated kinase 4
Synonyms:
IRAK-4 IRAK4_HUMAN Interleukin-1 receptor-associated kinase 4 (IRAK4) | Renal carcinoma antigen NY-REN-64
Type:
Protein
Mol. Mass.:
51519.08
Organism:
Homo sapiens (Human)
Description:
Q9NWZ3
Residue:
460
  
Inhibitor
Name:
BDBM434706
Synonyms:
US10562902, Compound 112 | US10562902, Compound 113
Type:
Small organic molecule
Emp. Form.:
C23H22N8O2
Mol. Mass.:
442.4732
SMILES:
Cn1cc(cn1)-n1ccc2nc(Nc3cnn(c3)-c3ccccc3)nc(O[C@H]3CCOC3)c12
: