Target
Bile acid receptor
Ligand
BDBM434771
Substrate
Meas. Tech.
Receptor Coactivator Assay
EC50
5.10±n/a nM
Citation
 Wang, XYang, XWu, JXiong, SPan, SCao, SZhang, Y Nitrogen-containing tricyclic compounds and uses thereof in medicine US Patent  US10562910 Publication Date 2/18/2020 
Target
Name:
Bile acid receptor
Synonyms:
BAR FXR HRR1 NR1H4_HUMAN RIP14 Retinoid X receptor-interacting protein 14 | farnesoid x receptor
Type:
Nuclear Receptor
Mol. Mass.:
55916.24
Organism:
Homo sapiens (Human)
Description:
Q96RI1
Residue:
486
  
Inhibitor
Name:
BDBM434771
Synonyms:
US10562910, Example 2
Type:
Small organic molecule
Emp. Form.:
C26H18Cl2N2O6
Mol. Mass.:
525.337
SMILES:
OC(=O)c1ccc2OCc3nc(OCc4c(onc4-c4c(Cl)cccc4Cl)C4CC4)ccc3Oc2c1
: