Target
cAMP and cAMP-inhibited cGMP 3',5'-cyclic phosphodiesterase 10A
Ligand
BDBM50004053
Substrate
Meas. Tech.
In Vitro Pharmacology Assay
IC50
<500±n/a nM
Citation
 Campbell, JEHewitt, MCJones, PXXie, L Substituted quinoxalines as PDE-10 inhibitors US Patent  US10562916 Publication Date 2/18/2020 
Target
Name:
cAMP and cAMP-inhibited cGMP 3',5'-cyclic phosphodiesterase 10A
Synonyms:
3',5'-cyclic phosphodiesterase PDE10A Phosphodiesterase 10 (PDE10) | Phosphodiesterase 10A
Type:
Protein
Mol. Mass.:
88412.52
Organism:
Homo sapiens (Human)
Description:
Q9Y233
Residue:
1055
  
Inhibitor
Name:
BDBM50004053
Synonyms:
CHEMBL2180006 US9834564, Compound 1
Type:
Small organic molecule
Emp. Form.:
C19H16N4
Mol. Mass.:
300.3571
SMILES:
C(Cc1cnc2ccccc2n1)c1nc(c[nH]1)-c1ccccc1
: