Target
cAMP and cAMP-inhibited cGMP 3',5'-cyclic phosphodiesterase 10A
Ligand
BDBM362501
Substrate
Meas. Tech.
In Vitro Pharmacology Assay
IC50
<500±n/a nM
Citation
 Campbell, JEHewitt, MCJones, PXXie, L Substituted quinoxalines as PDE-10 inhibitors US Patent  US10562916 Publication Date 2/18/2020 
Target
Name:
cAMP and cAMP-inhibited cGMP 3',5'-cyclic phosphodiesterase 10A
Synonyms:
3',5'-cyclic phosphodiesterase PDE10_HUMAN Phosphodiesterase 10A
Type:
Protein
Mol. Mass.:
88412.52
Organism:
Homo sapiens (Human)
Description:
Q9Y233
Residue:
779
  
Inhibitor
Name:
BDBM362501
Synonyms:
US10562916, Compound 61 | US9834564, Compound 61
Type:
Small organic molecule
Emp. Form.:
C19H15FN4O
Mol. Mass.:
334.347
SMILES:
Fc1cccc(c1)-c1c[nH]c(CCc2nc3ccccc3c(=O)[nH]2)n1
: