Target
cAMP and cAMP-inhibited cGMP 3',5'-cyclic phosphodiesterase 10A
Ligand
BDBM362646
Substrate
Meas. Tech.
In Vitro Pharmacology Assay
IC50
<500±n/a nM
Citation
 Campbell, JEHewitt, MCJones, PXXie, L Substituted quinoxalines as PDE-10 inhibitors US Patent  US10562916 Publication Date 2/18/2020 
Target
Name:
cAMP and cAMP-inhibited cGMP 3',5'-cyclic phosphodiesterase 10A
Synonyms:
3',5'-cyclic phosphodiesterase PDE10_HUMAN Phosphodiesterase 10A
Type:
Protein
Mol. Mass.:
88412.52
Organism:
Homo sapiens (Human)
Description:
Q9Y233
Residue:
779
  
Inhibitor
Name:
BDBM362646
Synonyms:
US10562916, Compound 208 | US9834564, Compound 208
Type:
Small organic molecule
Emp. Form.:
C19H18ClN5
Mol. Mass.:
351.833
SMILES:
Cc1nc(CCc2nc3c(ccc4ncccc34)n2C)nc(C)c1Cl
: