Target
Adenosine receptor A3
Ligand
BDBM434805
Substrate
Meas. Tech.
Binding Assays
Ki
40.9±1.9 nM
Citation
 Jacobson, KATosh, DKSalvemini, D A3 adenosine receptor agonists US Patent  US10577368 Publication Date 3/3/2020 
Target
Name:
Adenosine receptor A3
Synonyms:
A3AR Adenosine A3 receptor Gpcr2
Type:
PROTEIN
Mol. Mass.:
36460.91
Organism:
Mus musculus
Description:
ChEMBL_1515686
Residue:
319
  
Inhibitor
Name:
BDBM434805
Synonyms:
US10577368, Compound 19
Type:
Small organic molecule
Emp. Form.:
C22H28N6O3
Mol. Mass.:
424.4961
SMILES:
CNC(=O)[C@]12CC1[C@H]([C@H](O)C2O)n1cnc2c(NC)nc(nc12)C#CC1CCCCC1
: