Target
Adenosine receptor A3
Ligand
BDBM434830
Substrate
Meas. Tech.
Binding Assays
Ki
7.13±n/a nM
Citation
 Jacobson, KATosh, DKSalvemini, D A3 adenosine receptor agonists US Patent  US10577368 Publication Date 3/3/2020 
Target
Name:
Adenosine receptor A3
Synonyms:
A3 adenosine receptor (hA3) ADORA3 | Adenosine A3 receptor (A3AR)
Type:
G Protein-Coupled Receptor (GPCR)
Mol. Mass.:
36197.32
Organism:
Homo sapiens (Human)
Description:
P0DMS8
Residue:
318
  
Inhibitor
Name:
BDBM434830
Synonyms:
US10577368, Compound 125
Type:
Small organic molecule
Emp. Form.:
C23H24ClN9O3S
Mol. Mass.:
542.013
SMILES:
CNC(=O)[C@]12CC1[C@H]([C@H](O)C2O)n1cnc2c(NC3CCC3)nc(nc12)-n1cc(nn1)-c1ccc(Cl)s1
: