Target
Non-receptor tyrosine-protein kinase TYK2 [556-888]
Ligand
BDBM424826
Substrate
Meas. Tech.
TYK2 JH2 Domain Binding Assay
Kd
<0.2±n/a nM
Citation
 Masse, CEGreenwood, JRMondal, SCowen, SDMcLean, TH TYK2 inhibitors and uses thereof US Patent  US10577373 Publication Date 3/3/2020 
Target
Name:
Non-receptor tyrosine-protein kinase TYK2 [556-888]
Synonyms:
Non-receptor tyrosine-protein kinase TYK2 (G556-D888) TYK2 TYK2_HUMAN
Type:
Protein
Mol. Mass.:
36941.98
Organism:
Homo sapiens (Human)
Description:
P29597 (aa 556-888)
Residue:
333
  
Inhibitor
Name:
BDBM424826
Synonyms:
US10508120, Compound I-1330 US11046698, Compound I-1330
Type:
Small organic molecule
Emp. Form.:
C25H33N7O4
Mol. Mass.:
495.574
SMILES:
CNc1cc(Nc2cccn([C@@H]3CCC[C@H](C3)OC)c2=O)nc2c(cnn12)C(=O)N[C@@H]1CC[C@H]1OC
: