Target
Myeloperoxidase
Ligand
BDBM434849
Substrate
Meas. Tech.
MPO Peroxidation Assay (Amplex Red Assay)
IC50
50±n/a nM
Citation
 Smallheer, JMKick, EKValente, MNHu, CHHalpern, OSJusuf, S Macrocyclic inhibitors of myeloperoxidase US Patent  US10577383 Publication Date 3/3/2020 
Target
Name:
Myeloperoxidase
Synonyms:
84 kDa myeloperoxidase MPO Myeloperoxidase Myeloperoxidase heavy chain PERM_HUMAN
Type:
Enzyme
Mol. Mass.:
83888.32
Organism:
Homo sapiens (Human)
Description:
P05164
Residue:
745
  
Inhibitor
Name:
BDBM434849
Synonyms:
7-[(11S)-11-Methyl-18-oxa-3,4,10-triazatetracyclo[17.3.1.13,6.113,17]pentacosa-1(23),4,6(25),13,15,17 | US10577383, Example 7
Type:
Small organic molecule
Emp. Form.:
C27H28N8O
Mol. Mass.:
480.5642
SMILES:
C[C@H]1Cc2cccc(Oc3cccc(Cn4cc(cn4)C(CCN1)c1cc(N)nc4[nH]nnc14)c3)c2
: