Target
Myeloperoxidase
Ligand
BDBM434852
Substrate
Meas. Tech.
MPO Peroxidation Assay (Amplex Red Assay)
IC50
550±n/a nM
Citation
 Smallheer, JMKick, EKValente, MNHu, CHHalpern, OSJusuf, S Macrocyclic inhibitors of myeloperoxidase US Patent  US10577383 Publication Date 3/3/2020 
Target
Name:
Myeloperoxidase
Synonyms:
84 kDa myeloperoxidase MPO Myeloperoxidase Myeloperoxidase heavy chain PERM_HUMAN
Type:
Enzyme
Mol. Mass.:
83888.32
Organism:
Homo sapiens (Human)
Description:
P05164
Residue:
745
  
Inhibitor
Name:
BDBM434852
Synonyms:
7-[(17R)-17-Methyl-18-oxa-3,4,10-triazatetracyclo[17.3.1.13,6.112,16]pentacosa-1(23),4,6(25),12,14,16 | US10577383, Example 10
Type:
Small organic molecule
Emp. Form.:
C27H28N8O
Mol. Mass.:
480.5642
SMILES:
C[C@H]1Oc2cccc(Cn3cc(cn3)C(CCNCc3cccc1c3)c1cc(N)nc3[nH]nnc13)c2
: