Target
Diacylglycerol lipase-alpha
Ligand
BDBM434896
Substrate
Meas. Tech.
In Vitro Inhibition of DAGL
IC50
6000±n/a nM
Citation
 Cravatt, BFOgasawara, DViader, ADeng, HVan Der Wel, TVan Der Stelt, M Triazole DAGLα inhibitors US Patent  US10583137 Publication Date 3/10/2020 
Target
Name:
Diacylglycerol lipase-alpha
Synonyms:
C11orf11 DGLA_HUMAN NSDDR | Sn1-specific diacylglycerol lipase alpha
Type:
PROTEIN
Mol. Mass.:
114947.74
Organism:
Homo sapiens (Human)
Description:
ChEMBL_1449471
Residue:
1042
  
Inhibitor
Name:
BDBM434896
Synonyms:
(2-benzylpiperidin-1-yl)(4-(4- (3,5-dimethoxypyridin-4- yl)phenyl)-2H-1,2,3-triazol-2- yl)methanone | US10583137, Compound 70
Type:
Small organic molecule
Emp. Form.:
C28H29N5O3
Mol. Mass.:
483.5616
SMILES:
COc1cncc(OC)c1-c1ccc(cc1)-c1cnn(n1)C(=O)N1CCCCC1Cc1ccccc1
: