Target
Diacylglycerol lipase-alpha
Ligand
BDBM434899
Substrate
Meas. Tech.
In Vitro Inhibition of DAGL
IC50
<400±n/a nM
Citation
 Cravatt, BFOgasawara, DViader, ADeng, HVan Der Wel, TVan Der Stelt, M Triazole DAGLα inhibitors US Patent  US10583137 Publication Date 3/10/2020 
Target
Name:
Diacylglycerol lipase-alpha
Synonyms:
C11orf11 DGLA_HUMAN NSDDR | Sn1-specific diacylglycerol lipase alpha
Type:
PROTEIN
Mol. Mass.:
114947.74
Organism:
Homo sapiens (Human)
Description:
ChEMBL_1449471
Residue:
1042
  
Inhibitor
Name:
BDBM434899
Synonyms:
(2-benzylpiperidin-1-yl)(4-(4- (3,5-dichloropyridin-4- yl)phenyl)-1H-1,2,3-triazol-1- yl)methanone | US10583137, Compound 73
Type:
Small organic molecule
Emp. Form.:
C26H23Cl2N5O
Mol. Mass.:
492.4
SMILES:
Clc1cncc(Cl)c1-c1ccc(cc1)-c1cn(nn1)C(=O)N1CCCCC1Cc1ccccc1
: