Target
Neurotensin receptor type 1
Ligand
BDBM297623
Substrate
Meas. Tech.
NTR1 Ca2+ Flux Dose Response
EC50
<500±n/a nM
Citation
 Pinkerton, ABHershberger, PMPeddibhotla, SMaloney, PRHedrick, MP Small molecule agonists of neurotensin receptor 1 US Patent  US10584103 Publication Date 3/10/2020 
Target
Name:
Neurotensin receptor type 1
Synonyms:
Dopamine receptor D2L/neurotensin receptor NTS1 NTRR Neurotensin receptor 1 | neurotensin receptor type 1
Type:
PROTEIN
Mol. Mass.:
46278.89
Organism:
Homo sapiens (Human)
Description:
ChEMBL_1453811
Residue:
418
  
Inhibitor
Name:
BDBM297623
Synonyms:
2-({2-cyclopropyl-4-[4-(2- methoxy-phenyl)-piperidin-1- yl]-8-methyl-quinazolin-6- yl}-methyl-amino)-ethanol US10584103, Example 125
Type:
Small organic molecule
Emp. Form.:
C27H34N4O2
Mol. Mass.:
446.5845
SMILES:
COc1ccccc1C1CCN(CC1)c1nc(nc2c(C)cc(cc12)N(C)CCO)C1CC1
: