Target
Proto-oncogene tyrosine-protein kinase receptor Ret
Ligand
BDBM434989
Substrate
Meas. Tech.
RET Wild Type Assay at KM
IC50
<500±n/a nM
Citation
 Brubaker, JDKim, JLWilson, KJWilson, DDiPietro, LV Inhibitors of RET US Patent  US10584114 Publication Date 3/10/2020 
Target
Name:
Proto-oncogene tyrosine-protein kinase receptor Ret
Synonyms:
CDHF12 Cadherin family member 12 Proto-oncogene c-Ret RET51 Tyrosine-protein kinase Ret (RET)
Type:
Protein
Mol. Mass.:
124318.29
Organism:
Homo sapiens (Human)
Description:
P07949
Residue:
1114
  
Inhibitor
Name:
BDBM434989
Synonyms:
US10584114, Compound 101 | US11279688, Compound 101
Type:
Small organic molecule
Emp. Form.:
C25H29N9O
Mol. Mass.:
471.5575
SMILES:
Cc1cc(Nc2cc(C)nc(n2)[C@H]2CC[C@@H](CC2)C(=O)NCc2ccc(nc2)-n2cccn2)n[nH]1
: