Target
Proto-oncogene tyrosine-protein kinase receptor Ret [V804L]
Ligand
BDBM434997
Substrate
Meas. Tech.
RET V804L Gatekeeper Mutant Assay at KM
IC50
1250±n/a nM
Citation
 Brubaker, JDKim, JLWilson, KJWilson, DDiPietro, LV Inhibitors of RET US Patent  US10584114 Publication Date 3/10/2020 
Target
Name:
Proto-oncogene tyrosine-protein kinase receptor Ret [V804L]
Synonyms:
CDHF12 PTC RET kinase (V804L) RET51 | RET_HUMAN
Type:
Enzyme Catalytic Domain
Mol. Mass.:
124332.32
Organism:
Homo sapiens (Human)
Description:
P07949[V804L]
Residue:
1114
  
Inhibitor
Name:
BDBM434997
Synonyms:
US10584114, Compound 110 | US11279688, Compound 110
Type:
Small organic molecule
Emp. Form.:
C27H31FN8O
Mol. Mass.:
502.5864
SMILES:
C[C@H](NC(=O)[C@H]1CC[C@H](CC1)c1cc(C)cc(Nc2cc(C)[nH]n2)n1)c1ccc(nc1)-n1cc(F)cn1
: