Target
Transient receptor potential cation channel subfamily A member 1
Ligand
BDBM435057
Substrate
Meas. Tech.
Measurement of TRPA1 Antagonist Activity
IC50
31.0±n/a nM
Citation
 Kobayashi, KSuzuki, TOkuzumi, T Heterocyclic sulfonamide derivative and medicine containing same US Patent  US10584116 Publication Date 3/10/2020 
Target
Name:
Transient receptor potential cation channel subfamily A member 1
Synonyms:
ANKTM1 TRPA1 Transformation-sensitive protein p120 | Transient receptor potential cation channel subfamily A member 1 (TRPA1)
Type:
Protein
Mol. Mass.:
127514.20
Organism:
Homo sapiens (Human)
Description:
O75762
Residue:
1119
  
Inhibitor
Name:
BDBM435057
Synonyms:
(2S)-1-(5-fluorobenzofuran-2-yl)sulfonyl-N- [[1-isopropyl-2-oxo-5-[6-(trifluoromethyl)-3- pyridyl]-3-pyridyl]methyl]pyrrolidine-2- carboxamide | US10584116, Example 37
Type:
Small organic molecule
Emp. Form.:
C28H26F4N4O5S
Mol. Mass.:
606.588
SMILES:
CC(C)n1cc(cc(CNC(=O)[C@@H]2CCCN2S(=O)(=O)c2cc3cc(F)ccc3o2)c1=O)-c1ccc(nc1)C(F)(F)F
: