Target
Glutaminyl-peptide cyclotransferase
Ligand
BDBM435084
Substrate
Meas. Tech.
QC Inhibition Assay
Ki
76.0±n/a nM
Citation
 Chen, CShih, CChen, CWang, HHuang, K Benzimidazole compounds and use thereof for treating Alzheimer's Disease or Huntington's Disease US Patent  US10584120 Publication Date 3/10/2020 
Target
Name:
Glutaminyl-peptide cyclotransferase
Synonyms:
Glutaminyl Cyclase Glutaminyl-peptide cyclotransferase Glutaminyl-tRNA cyclotransferase QPCT | QPCT_HUMAN
Type:
Enzyme
Mol. Mass.:
40877.05
Organism:
Homo sapiens (Human)
Description:
Q16769
Residue:
361
  
Inhibitor
Name:
BDBM435084
Synonyms:
US10584120, Compound 15
Type:
Small organic molecule
Emp. Form.:
C21H18N4OS
Mol. Mass.:
374.459
SMILES:
Cc1cc(cs1)-c1ccc(cc1)C1CNC(=O)N1c1ccc2[nH]cnc2c1
: