Target
Glutamate receptor ionotropic, NMDA 2B
Ligand
BDBM435145
Substrate
Meas. Tech.
NR2B Antagonist Activity
IC50
48.2±n/a nM
Citation
 Shapiro, G 3,3-difluoropiperidine carbamate heterocyclic compounds as NR2B NMDA receptor antagonists US Patent  US10584127 Publication Date 3/10/2020 
Target
Name:
Glutamate receptor ionotropic, NMDA 2B
Synonyms:
GRIN2B Glutamate [NMDA] receptor subunit epsilon 2 N-methyl D-aspartate receptor subtype 2B NMDAR2B NR3 | hNR3
Type:
PROTEIN
Mol. Mass.:
166375.46
Organism:
Homo sapiens (Human)
Description:
ChEMBL_1438829
Residue:
1484
  
Inhibitor
Name:
BDBM435145
Synonyms:
US10584127, Compound E1-9.2 US11752155, Compound E1-9.2B'
Type:
Small organic molecule
Emp. Form.:
C21H23F2N5O2
Mol. Mass.:
415.4364
SMILES:
Cc1ccc(COC(=O)N2CC[C@H](CNc3nc4ccccn4n3)C(F)(F)C2)cc1
: