Target
Glutamate receptor ionotropic, NMDA 2A
Ligand
BDBM435145
Substrate
Meas. Tech.
NR2B Antagonist Activity
IC50
>10000000±n/a nM
Citation
 Shapiro, G 3,3-difluoropiperidine carbamate heterocyclic compounds as NR2B NMDA receptor antagonists US Patent  US10584127 Publication Date 3/10/2020 
Target
Name:
Glutamate receptor ionotropic, NMDA 2A
Synonyms:
GRIN2A Glutamate [NMDA] receptor Glutamate [NMDA] receptor subunit epsilon-1 NMDA receptor subtype 2A protein (NR2A) NMDE1_HUMAN hNR2A
Type:
Mol. Mass.:
165293.76
Organism:
Homo sapiens (Human)
Description:
Residue:
1464
  
Inhibitor
Name:
BDBM435145
Synonyms:
US10584127, Compound E1-9.2 US11752155, Compound E1-9.2B'
Type:
Small organic molecule
Emp. Form.:
C21H23F2N5O2
Mol. Mass.:
415.4364
SMILES:
Cc1ccc(COC(=O)N2CC[C@H](CNc3nc4ccccn4n3)C(F)(F)C2)cc1
: