Target
Glutamate receptor ionotropic, NMDA 2B
Ligand
BDBM388299
Substrate
Meas. Tech.
NR2B Antagonist Activity
IC50
14.8±n/a nM
Citation
 Shapiro, G 3,3-difluoropiperidine carbamate heterocyclic compounds as NR2B NMDA receptor antagonists US Patent  US10584127 Publication Date 3/10/2020 
Target
Name:
Glutamate receptor ionotropic, NMDA 2B
Synonyms:
GRIN2B Glutamate [NMDA] receptor subunit epsilon 2 N-methyl D-aspartate receptor subtype 2B NMDAR2B NR3 | hNR3
Type:
PROTEIN
Mol. Mass.:
166375.46
Organism:
Homo sapiens (Human)
Description:
ChEMBL_1438829
Residue:
1484
  
Inhibitor
Name:
BDBM388299
Synonyms:
US10294230, Compound E1-1.3 US11136328, Compound E1-1.3 | US11752155, Compound E1-1.3B'
Type:
Small organic molecule
Emp. Form.:
C19H19ClF2N6O2
Mol. Mass.:
436.843
SMILES:
FC1(F)CN(CC[C@@H]1CNc1nccn2cnnc12)C(=O)OCc1ccc(Cl)cc1
: